Home page logo
/

nmap-dev logo Nmap Development mailing list archives

Re: Ncat portable for Windows (static edition)
From: Shinnok <admin () shinnok com>
Date: Wed, 22 Jun 2011 20:27:48 +0300

Ahh, yes, on a final minute call I made a decision to base the nsock's new configuration on
existing ReleaseNoPcap created by ithilgore about a year ago.
It seems to not do what it purposes to do thus I created a new one called "Static" based on Release with the proper changes just like for nbase and ncat, like I planned to do initially.
All should be fine now(r24245), please confirm.

On 6/22/2011 7:57 PM, David Fifield wrote:
Thanks for doing this. I tried buidling it, but got some errors. They
appear to be related to Nsock still using pcap. Did you find a way to
disable pcap in the compiler command line?

------ Rebuild All started: Project: ncat, Configuration: Static Win32 ------
   Copying ca-bundle.crt to output directory...
   base64.c
   http.c
   http_digest.c
   ncat_broker.c
   ncat_connect.c
   ncat_core.c
   ncat_exec_win.c
   ncat_listen.c
   ncat_main.c
   ncat_proxy.c
   ncat_ssl.c
   ncat_win.c
   sys_wrap.c
   util.c
   Generating Code...
LINK : warning LNK4098: defaultlib 'LIBCMTD' conflicts with use of other libs; use /NODEFAULTLIB:library
nsock.lib(nsock_iod.obj) : error LNK2019: unresolved external symbol _pcap_close referenced in function _nsi_delete
nsock.lib(nsock_pcap.obj) : error LNK2019: unresolved external symbol _pcap_setnonblock referenced in function 
_nsock_pcap_open
nsock.lib(nsock_pcap.obj) : error LNK2019: unresolved external symbol _pcap_setmintocopy referenced in function 
_nsock_pcap_open
nsock.lib(nsock_pcap.obj) : error LNK2019: unresolved external symbol _pcap_open_live referenced in function 
_nsock_pcap_open
nsock.lib(nsock_pcap.obj) : error LNK2019: unresolved external symbol _pcap_freecode referenced in function "char * __cdecl 
nsock_pcap_set_filter(struct pcap *,char const *,char const *)" (?nsock_pcap_set_filter@@YAPADPAUpcap@@PBD1 () Z)
nsock.lib(nsock_pcap.obj) : error LNK2019: unresolved external symbol _pcap_setfilter referenced in function "char * __cdecl 
nsock_pcap_set_filter(struct pcap *,char const *,char const *)" (?nsock_pcap_set_filter@@YAPADPAUpcap@@PBD1 () Z)
nsock.lib(nsock_pcap.obj) : error LNK2019: unresolved external symbol _pcap_geterr referenced in function "char * __cdecl 
nsock_pcap_set_filter(struct pcap *,char const *,char const *)" (?nsock_pcap_set_filter@@YAPADPAUpcap@@PBD1 () Z)
nsock.lib(nsock_pcap.obj) : error LNK2019: unresolved external symbol _pcap_compile referenced in function "char * __cdecl 
nsock_pcap_set_filter(struct pcap *,char const *,char const *)" (?nsock_pcap_set_filter@@YAPADPAUpcap@@PBD1 () Z)
nsock.lib(nsock_pcap.obj) : error LNK2019: unresolved external symbol _pcap_lookupnet referenced in function "char * __cdecl 
nsock_pcap_set_filter(struct pcap *,char const *,char const *)" (?nsock_pcap_set_filter@@YAPADPAUpcap@@PBD1 () Z)
nsock.lib(nsock_pcap.obj) : error LNK2019: unresolved external symbol _pcap_datalink referenced in function "int __cdecl 
nsock_pcap_get_l3_offset(struct pcap *,int *)" (?nsock_pcap_get_l3_offset@@YAHPAUpcap@@PAH () Z)
nsock.lib(nsock_pcap.obj) : error LNK2019: unresolved external symbol _pcap_next_ex referenced in function "int __cdecl 
do_actual_pcap_read(struct msevent *)" (?do_actual_pcap_read@@YAHPAUmsevent@@@Z)
.\Release/ncat.exe : fatal error LNK1120: 11 unresolved externals
========== Rebuild All: 2 succeeded, 1 failed, 0 skipped ==========


_______________________________________________
Sent through the nmap-dev mailing list
http://cgi.insecure.org/mailman/listinfo/nmap-dev
Archived at http://seclists.org/nmap-dev/


  By Date           By Thread  

Current thread:
[ Nmap | Sec Tools | Mailing Lists | Site News | About/Contact | Advertising | Privacy ]